{"text_format":"1","workbook":"xlsx","n_sheets":2,"sheets":["Form","Premiums"],"not_rendered":{"charts":0,"images":1,"macros":1,"external_links":0,"defined_names":1,"comments":1,"pivot_tables":0},"unopened":[],"bounds":{"document_bytes":16777216,"sheet_cells":100000,"rows_first":2000,"rows_last":500,"rows_between":2000,"halvings":0,"cell_chars":16384,"cell_head_chars":4096},"cells_cut":0,"cells_raw":0,"read":"whole","date_system":"1900"}

{"sheet":"Form","index":0,"n_rows":1202,"n_cols":12,"rows_kept":1202,"cut":false,"hidden":false,"merged":[[37,6,37,8],[86,1,86,11],[87,1,87,11],[118,1,118,11],[37,3,37,5],[34,3,34,5],[32,3,32,5],[31,3,31,5],[26,3,26,5],[28,3,28,5],[27,3,27,5],[30,3,30,5],[23,6,23,8],[35,3,35,5],[29,3,29,5],[33,3,33,5],[35,6,35,8],[25,3,25,5],[23,3,24,5],[65,1,65,11],[59,7,59,10],[60,7,60,10],[45,1,45,11],[56,2,56,3],[47,1,47,10],[48,1,48,10],[49,1,49,10],[50,1,50,10],[51,1,51,10],[52,1,52,10],[63,1,63,11],[18,4,18,5],[18,1,18,3],[20,1,20,3],[43,1,43,11],[38,6,38,8],[38,3,38,5],[40,1,40,10],[41,7,41,10],[42,7,42,10],[41,2,41,3],[16,1,16,3],[19,1,19,11],[20,4,20,5],[2,1,2,11],[15,1,15,11],[14,4,14,6],[12,4,12,10],[10,4,10,10],[14,1,14,3],[13,1,13,11],[9,1,9,11],[11,1,11,11],[5,1,7,11],[10,1,10,3],[12,1,12,3],[71,1,71,11],[72,1,73,11],[75,1,76,11],[66,1,67,11],[68,1,68,11],[69,1,70,11]]}
[]
[]
[null,"Colonnade KKV - Csoportos Balesetbiztosítás"]
[]
[]
[null,"A Colonnade Insurance S.A. Magyarországi Fióktelepének csoportos balesetbiztosítási terméke gyors, egyszerű, hatékony és költségtakarékos megoldást jelent kis- és középvállalatok részére. Egy váratlanul bekövetkezett baleset esetén gyors anyagi segítséget nyújt munkavállalója részére, ezzel is segítve az alkalamzott lojalitását a munkáltató felé."]
[]
[]
[]
[]
[null,"Szerződő neve:",null,null,null,null,null,null,null,null,null,{"$f":"IF(E11=\"\",\"*\",\"\")","v":"*"}]
[]
[null,"Szerződő címe:",null,null,null,null,null,null,null,null,null,{"$f":"IF(E13=\"\",\"*\",\"\")","v":"*"}]
[]
[null,"Tevékenység:",null,null,null,null,null,{"$f":"IF(OR(E15=\"\",E15=\"Kérem, válasszon!\"),\"*\",\"\")","v":"*"}]
[null,{"$f":"IF(OR(E15=\"\",E15=\"Kérem, válasszon!\",E15=\"egyéb\"),\"\",\"A megjelölt tevékenységi körre egyedi elbírálás alapján tud Társaságunk ajánlatot készíteni, kérjük, vegye fel a kapcsolatot a kockázatelbírálónkkal a 801-0801-es telefonszámon.\")","v":""}]
[null,"Kockázatviselés kezdete:",null,null,null,{"$f":"IF(E17=\"\",\"*\",\"\")","v":"*"}]
[]
[null,"Biztosítottak száma:",null,null,null,null,{"$f":"IF(E19=\"\",\"*\",\"\")","v":"*"}]
[]
[null,"Választott opció:",null,null,null,null,{"$f":"IF(OR(E21=\"\",E21=\"Kérem, válasszon!\"),\"*\",\"\")","v":"*"}]
[]
[]
[null,null,null,"Szolgáltatás",null,null,"Biztosítási összeg Ft/fő"]
[null,null,null,null,null,null,"A Opció","B Opció","C Opció"]
[null,null,null,"Baleseti halál",null,null,6000000,9000000,12000000]
[null,null,null,"Kiterjesztés - temetési költségek",null,null," 1 000 000"," 1 000 000"," 1 000 000"]
[null,null,null,"Baleseti Maradandó Rokkantság (1-100%)",null,null,6000000,9000000,12000000]
[null,null,null,"Kiterjesztés - átképzési költségek",null,null," 1 000 000"," 1 000 000"," 1 000 000"]
[null,null,null,"Kiterjesztés - kerekesszék költsége",null,null," 1 000 000"," 1 000 000"," 1 000 000"]
[null,null,null,"Csonttörés (százalékos)",null,null,150000,450000,750000]
[null,null,null,"Baleseti kórházi napi térítés\n(napi térítés, 1. naptól max. 365 napig)",null,null,4500,7500,9000]
[null,null,null,"Baleseti műtéti térítés",null,null,90000,180000,255000]
[null,null,null,"Ideiglenes teljes keresőképtelenség  baleset esetén (napi térítés, 1. naptól max. 90 napig)",null,null,1500,3000,4500]
[]
[null,null,null,"Szolgáltatási időszak",null,null,"24 órás, világszerte érvényes fedezet"]
[]
[null,null,null,"Éves biztosítási díj / fő",null,null,{"$f":"IF(OR(E19=\"\",E21=\"\"),\"\",G39/E19)","v":""}]
[null,null,null,"Éves biztosítási díj összesen",null,null,{"$f":"IF(E19=\"\",\"\",IF(E21=\"A\",VLOOKUP(E19,Premiums!A1:D99,2,FALSE),IF(E21=\"B\",VLOOKUP(E19,Premiums!A1:D99,3,FALSE),IF(E21=\"C\",VLOOKUP(E19,Premiums!A1:D99,4,FALSE),\"\"))))","v":""}]
[]
[null,"Alulírott Szerződő tudomásul veszem, hogy a Biztosító által 202_________________-én kiadott tájékoztató díjajánlat aláírásommal a Biztosító felé szerződéskötésre tett ajánlattá (továbbiakban: ajánlat) alakul át.\n\nTudomásul veszem, hogy\n- jelen ajánlati lap visszaküldése nem eredményezi sem a biztosítási szerződés automatikus,  létrejöttét sem a biztosító automatikus kockázatviselését;\n- a biztosítási szerződéssel kapcsolatos adatokat a biztosító nyilvántartja és kezeli.\n\nAlulírott, mint Szerződő aláírásra jogosult képviselője, ezúton tudomásul veszem, hogy a biztosítási kötvényt és a hozzá kapcsolódó dokumentumokat elektronikus formában fogom megkapni. \n\nJelen tájékoztató díjajánlatot elfogadom.\n"]
[null,"Dátum:",{"$f":"TODAY()","v":"2023-01-23"}]
[null,null,null,null,null,null,null,"szerződő/biztosított/társbiztosított \n        cégszerű aláírása"]
[null,"NYILATKOZAT"]
[]
[null,"(a 2014. évi LXXXVIII. Törvényben előírt előzetes tájékoztatásról, \naz ajánlatban megadott adatokról, más biztosítók megkereséséről) "]
[]
[null,"Alulírottak, a szerződő / biztosított / társbiztosított cégjegyzésre jogosult képviseletében ezennel kijelentjük, hogy a biztosító adatairól, a biztosítási szerződés jellemzőiről részletes írásbeli tájékoztatást kaptunk, az ezen információkat, adatokat, feltételeket tartalmazó, az ajánlatban felsorolt biztosítási feltételeket, szabályzatokat, biztosítási terméktájékoztatókat az ajánlat megtételét és aláírását megelőzően hiánytalanul átvettük, az abban foglaltakat áttanulmányoztuk, megértettük és tudomásul vettük. "]
[null,"Kijelentjük továbbá, hogy a biztosítási ajánlaton megadott adatok, információk helyesek és azokért az ajánlat aláírásával felelősséget vállalunk."]
[null,"Tudomásul vesszük, hogy a biztosítási szerződés az általunk tett biztosítási ajánlaton alapul, ezért esetleges kárrendezés során a biztosító az abban foglaltakat is figyelembe veszi. "]
[null,"Az ajánlatban szereplő kockázatviselési kezdettel hozzájárulok, hogy a biztosítókról és biztosítási tevékenységről szóló 2014. évi LXXXVIII. törvény 149 § alapján - a veszélyközösség megóvása érdekében,- a jogszabályban foglalt vagy a szerződésben vállalt kötelezettségek teljesítése során a szolgáltatások jogszabályoknak és szerződésnek megfelelő teljesítése, a biztosítási szerződésekkel kapcsolatos visszaélések megakadályozása céljából a Biztosító megkereséssel fordulhat más biztosítóhoz, illetőleg köteles adatot szolgáltatni a törvényben meghatározott adatok vonatkozásában az őt megkereső biztosítónak."]
[]
[null,"(A megfelelő válaszhoz tartozó négyzetet kérjük jelölje „x”-szel)"]
[null,"igen","c","nem","c"]
[]
[]
[null,"Dátum:",{"$f":"TODAY()","v":"2023-01-23"}]
[]
[]
[]
[null,null,null,null,null,null,null,"    szerződő/biztosított/társbiztosított \n        cégszerű aláírása\n"]
[]
[]
[null,"NYILATKOZAT"]
[]
[null,"1. Orosz/Fehérorosz/Ukrán tulajdonos vagy befolyás"]
[null,"Kijelentem, hogy az általam képviselt társaság / szerződő nem rendelkezik sem közvetetten, sem közvetlenül orosz, fehérorosz vagy ukrán tulajdonossal vagy ellenőrző befolyást gyakorló személlyel (Ororszországban, Fehéroroszországban vagy Ukrajnában bejegyzett cég, vagy ezen országokban állandó lakcímmel rendelkező magánszemélyek)."]
[]
[null,"2. Oroszországban / Fehéroroszországban / Ukrajnában bejegyzett leányvállalatok"]
[null,"Kijelentem, hogy az általam képviselt társaság / szerződő nem rendelkezik Oroszországban vagy Fehéroroszországban, illetve Ukrajnában bejegyzett társasággal, eszközzel, érdekeltséggel vagy állandó telephellyel."]
[]
[null,"3. Oroszországgal / Fehéroroszországgal / Ukrajnával fennálló üzleti kapcsolatok"]
[null,"Kijelentem, hogy az általam képviselt társaság / szerződő közvetlenül nem értékesít semmilyen terméket, illetve nem nyújt semmilyen szolgáltatást orosz, fehérorosz, illetve ukrán piacra."]
[]
[]
[null,"Kijelentem, hogy az általam képviselt társaság / szerződő nem vásárol semmilyen terméket, illetve szolgáltatást orosz, fehérorosz, illetve ukrán személy(ek)től (Oroszországban, Fehéroroszországban vagy Ukrajnában bejegyzett cégtől, vagy ezen országokban állandó lakcímmel rendelkező magánszemélyektől)."]
[]
[]
[null,null,null,null,"Kelt: ..........................................., 20_ _ (év) _ _ (hó) _ _ (nap)"]
[]
[]
[]
[null,null,null,null,"______________________________________________"]
[null,null,null,null,"Szerződő /Biztosított / Társbiztosított cégszerű aláírása"]
[]
[null,"Záradék száma: INDAH-001-2022"]
[null,"MÓDOSÍTÁSI ZÁRADÉK"]
[null,"(Csoportos baleset-, betegség-, és utasbiztosítás)"]
[]
[null,"1.A Biztosítási szerződés módosítása"]
[null,"A Colonnade Insurance S.A. Magyarországi Fióktelepe (székhely: 1139 Budapest, Váci út 99.; továbbiakban: Biztosító) minden évben a Biztosítási szerződés "]
[null,"évfordulója alkalmával a díjszámítás alapját képező adatok változása alapján jogosult aktualizálni a biztosítási szerződést."]
[]
[null,"2. A Biztosítási díj módosításának mechanizmusa"]
[null,"A biztosítási díj módosításának alapjául a Központi Statisztikai Hivatal által közzétett fogyasztási főcsoportok árindexeinek átlaga figyelembevételével"]
[null,"és az orvosi költségek indexszámai szolgálnak. "]
[]
[null,"3. A módosítás elfogadása, annak jogkövetkezményei és a Biztosító teljesítésére gyakorolt hatása"]
[null,"A Biztosító a módosított díjról a Biztosítási szerződés évfordulója előtt legalább 60 nappal írásban értesíti a Szerződőt. "]
[]
[null,"Amennyiben a Szerződő elfogadja a Biztosítási szerződés aktualizálását, akkor nincs teendője. Biztosító megküldi a Szerződőnek a módosított kötvényt, "]
[null,"amely alapján az évfordulót követően az aktualizált biztosítási díjjal folytatódik a szerződése."]
[]
[null,"Amennyiben a Szerződő nem fogadja el a módosítást, akkor ezt a Biztosító felé az évforduló előtt minimum 45 nappal írásban jeleznie kell. "]
[null,"Ebben az esetben a szerződés az évfordulót követően is változatlan éves díjon folytatódik. "]
[]
[null,"Figyelem! Amennyiben a Szerződő nem jelzi a megadott határidőben, hogy nem kíván élni az aktualizálással, akkor az a módosított biztosítási díj "]
[null,"elfogadásának minősül."]
[]
[null,"A biztosítási díj módosítására először a szerződés létrejöttét követő első évforduló alkalmával, meglévő szerződés esetén pedig a Módosítási záradék "]
[null,"elfogadását követő első évforduló alkalmával kerül sor."]
[]
[null,"Jelen pont szerinti záradékra tekintettel a Biztosítási feltételek eltérnek a Polgári Törvénykönyv vonatkozó rendelkezéseitől."]
[]
[null,"4. Egyéb"]
[null,"A Biztosító által tett ajánlatban rögzített indexálástól eltérő módosítási igény esetén a Szerződőnek lehetősége van a Biztosítási szerződés "]
[null,"aktualizálására az évfordulótól függetlenül is."]
[]
[null,"NYILATKOZAT"]
[]
[null,"Alulírott ……………………………………………, ügyvezető mint a Szerződő/Biztosított aláírásra jogosult képviselője kijelentem, hogy:"]
[]
[null,"a Biztosító által megküldött Módosítási záradékot elolvastam, megértettem és azt a Biztosítási szerződés évfordulójától érvényesnek elfogadom."]
[]
[null,"Kelt: ..........................................., 20_ _ (év) _ _ (hó) _ _ (nap)"]
[]
[null,null,null,null,null,"………………………………………………………………………….."]
[null,null,null,null,null,"Szerződő cégszerű aláírása"]
["Létszám",null,"Dátum",null,"Tevékenység"]
[3,null,{"$f":"TODAY()+1","v":"2023-01-24"},null,"Kérem, válasszon!"]
[4,null,{"$f":"C130+1","v":"2023-01-25"},null,"katonai, félkatonai"]
[5,null,{"$f":"C131+1","v":"2023-01-26"},null,"rendőrségi"]
[6,null,"2023-01-27",null,"vagyonvédelem"]
[7,null,"2023-01-28",null,"taxi sofőr"]
[8,null,"2023-01-29",null,"légiközlekedés (pilóta, légiutas kísérő stb.)"]
[9,null,"2023-01-30",null,"mentők, OMSZ alkalmazott"]
[10,null,"2023-01-31",null,"tűzoltó"]
[11,null,"2023-02-01",null,"búvár"]
[12,null,"2023-02-02",null,"ipari alpinista"]
[13,null,"2023-02-03",null,"nehéz fizikai munkavégés"]
[14,null,"2023-02-04",null,"magasépítés"]
[15,null,"2023-02-05",null,"hajózás"]
[16,null,"2023-02-06",null,"konténeres szállítás"]
[17,null,"2023-02-07",null,"darukezelés"]
[18,null,"2023-02-08",null,"amatőr, profi- és félprofi sport"]
[19,null,"2023-02-09",null,"egyéb"]
[20,null,"2023-02-10"]
[21,null,"2023-02-11"]
[22,null,"2023-02-12"]
[23,null,"2023-02-13"]
[24,null,"2023-02-14"]
[25,null,"2023-02-15"]
[26,null,"2023-02-16"]
[27,null,"2023-02-17"]
[28,null,"2023-02-18"]
[29,null,"2023-02-19"]
[30,null,"2023-02-20"]
[31,null,"2023-02-21"]
[32,null,"2023-02-22"]
[33,null,"2023-02-23"]
[34,null,"2023-02-24"]
[35,null,"2023-02-25"]
[36,null,"2023-02-26"]
[37,null,"2023-02-27"]
[38,null,"2023-02-28"]
[39,null,"2023-03-01"]
[40,null,"2023-03-02"]
[41,null,"2023-03-03"]
[42,null,"2023-03-04"]
[43,null,"2023-03-05"]
[44,null,"2023-03-06"]
[45,null,"2023-03-07"]
[46,null,"2023-03-08"]
[47,null,"2023-03-09"]
[48,null,"2023-03-10"]
[49,null,"2023-03-11"]
[50,null,"2023-03-12"]
[51,null,"2023-03-13"]
[52,null,"2023-03-14"]
[53,null,"2023-03-15"]
[54,null,"2023-03-16"]
[55,null,"2023-03-17"]
[56,null,"2023-03-18"]
[57,null,"2023-03-19"]
[58,null,"2023-03-20"]
[59,null,"2023-03-21"]
[60,null,"2023-03-22"]
[61,null,"2023-03-23"]
[62,null,"2023-03-24"]
[63,null,"2023-03-25"]
[64,null,"2023-03-26"]
[65,null,"2023-03-27"]
[66,null,"2023-03-28"]
[67,null,"2023-03-29"]
[68,null,"2023-03-30"]
[69,null,{"$f":"C195+1","v":"2023-03-31"}]
[70,null,"2023-04-01"]
[71,null,"2023-04-02"]
[72,null,"2023-04-03"]
[73,null,"2023-04-04"]
[74,null,"2023-04-05"]
[75,null,"2023-04-06"]
[76,null,"2023-04-07"]
[77,null,"2023-04-08"]
[78,null,"2023-04-09"]
[79,null,"2023-04-10"]
[80,null,"2023-04-11"]
[81,null,"2023-04-12"]
[82,null,"2023-04-13"]
[83,null,"2023-04-14"]
[84,null,"2023-04-15"]
[85,null,"2023-04-16"]
[86,null,"2023-04-17"]
[87,null,"2023-04-18"]
[88,null,"2023-04-19"]
[89,null,"2023-04-20"]
[90,null,"2023-04-21"]
[91,null,"2023-04-22"]
[92,null,"2023-04-23"]
[93,null,"2023-04-24"]
[94,null,"2023-04-25"]
[95,null,"2023-04-26"]
[96,null,"2023-04-27"]
[97,null,"2023-04-28"]
[98,null,"2023-04-29"]
[99,null,"2023-04-30"]
[100,null,"2023-05-01"]
[null,null,"2023-05-02"]
[null,null,"2023-05-03"]
[null,null,"2023-05-04"]
[null,null,"2023-05-05"]
[null,null,"2023-05-06"]
[null,null,"2023-05-07"]
[null,null,"2023-05-08"]
[null,null,"2023-05-09"]
[null,null,"2023-05-10"]
[null,null,"2023-05-11"]
[null,null,"2023-05-12"]
[null,null,"2023-05-13"]
[null,null,"2023-05-14"]
[null,null,"2023-05-15"]
[null,null,"2023-05-16"]
[null,null,"2023-05-17"]
[null,null,"2023-05-18"]
[null,null,"2023-05-19"]
[null,null,"2023-05-20"]
[null,null,"2023-05-21"]
[null,null,"2023-05-22"]
[null,null,"2023-05-23"]
[null,null,"2023-05-24"]
[null,null,"2023-05-25"]
[null,null,"2023-05-26"]
[null,null,"2023-05-27"]
[null,null,"2023-05-28"]
[null,null,"2023-05-29"]
[null,null,"2023-05-30"]
[null,null,"2023-05-31"]
[null,null,"2023-06-01"]
[null,null,"2023-06-02"]
[null,null,{"$f":"C259+1","v":"2023-06-03"}]
[null,null,"2023-06-04"]
[null,null,"2023-06-05"]
[null,null,"2023-06-06"]
[null,null,"2023-06-07"]
[null,null,"2023-06-08"]
[null,null,"2023-06-09"]
[null,null,"2023-06-10"]
[null,null,"2023-06-11"]
[null,null,"2023-06-12"]
[null,null,"2023-06-13"]
[null,null,"2023-06-14"]
[null,null,"2023-06-15"]
[null,null,"2023-06-16"]
[null,null,"2023-06-17"]
[null,null,"2023-06-18"]
[null,null,"2023-06-19"]
[null,null,"2023-06-20"]
[null,null,"2023-06-21"]
[null,null,"2023-06-22"]
[null,null,"2023-06-23"]
[null,null,"2023-06-24"]
[null,null,"2023-06-25"]
[null,null,"2023-06-26"]
[null,null,"2023-06-27"]
[null,null,"2023-06-28"]
[null,null,"2023-06-29"]
[null,null,"2023-06-30"]
[null,null,"2023-07-01"]
[null,null,"2023-07-02"]
[null,null,"2023-07-03"]
[null,null,"2023-07-04"]
[null,null,"2023-07-05"]
[null,null,"2023-07-06"]
[null,null,"2023-07-07"]
[null,null,"2023-07-08"]
[null,null,"2023-07-09"]
[null,null,"2023-07-10"]
[null,null,"2023-07-11"]
[null,null,"2023-07-12"]
[null,null,"2023-07-13"]
[null,null,"2023-07-14"]
[null,null,"2023-07-15"]
[null,null,"2023-07-16"]
[null,null,"2023-07-17"]
[null,null,"2023-07-18"]
[null,null,"2023-07-19"]
[null,null,"2023-07-20"]
[null,null,"2023-07-21"]
[null,null,"2023-07-22"]
[null,null,"2023-07-23"]
[null,null,"2023-07-24"]
[null,null,"2023-07-25"]
[null,null,"2023-07-26"]
[null,null,"2023-07-27"]
[null,null,"2023-07-28"]
[null,null,"2023-07-29"]
[null,null,"2023-07-30"]
[null,null,"2023-07-31"]
[null,null,"2023-08-01"]
[null,null,"2023-08-02"]
[null,null,"2023-08-03"]
[null,null,"2023-08-04"]
[null,null,"2023-08-05"]
[null,null,{"$f":"C323+1","v":"2023-08-06"}]
[null,null,"2023-08-07"]
[null,null,"2023-08-08"]
[null,null,"2023-08-09"]
[null,null,"2023-08-10"]
[null,null,"2023-08-11"]
[null,null,"2023-08-12"]
[null,null,"2023-08-13"]
[null,null,"2023-08-14"]
[null,null,"2023-08-15"]
[null,null,"2023-08-16"]
[null,null,"2023-08-17"]
[null,null,"2023-08-18"]
[null,null,"2023-08-19"]
[null,null,"2023-08-20"]
[null,null,"2023-08-21"]
[null,null,"2023-08-22"]
[null,null,"2023-08-23"]
[null,null,"2023-08-24"]
[null,null,"2023-08-25"]
[null,null,"2023-08-26"]
[null,null,"2023-08-27"]
[null,null,"2023-08-28"]
[null,null,"2023-08-29"]
[null,null,"2023-08-30"]
[null,null,"2023-08-31"]
[null,null,"2023-09-01"]
[null,null,"2023-09-02"]
[null,null,"2023-09-03"]
[null,null,"2023-09-04"]
[null,null,"2023-09-05"]
[null,null,"2023-09-06"]
[null,null,"2023-09-07"]
[null,null,"2023-09-08"]
[null,null,"2023-09-09"]
[null,null,"2023-09-10"]
[null,null,"2023-09-11"]
[null,null,"2023-09-12"]
[null,null,"2023-09-13"]
[null,null,"2023-09-14"]
[null,null,"2023-09-15"]
[null,null,"2023-09-16"]
[null,null,"2023-09-17"]
[null,null,"2023-09-18"]
[null,null,"2023-09-19"]
[null,null,"2023-09-20"]
[null,null,"2023-09-21"]
[null,null,"2023-09-22"]
[null,null,"2023-09-23"]
[null,null,"2023-09-24"]
[null,null,"2023-09-25"]
[null,null,"2023-09-26"]
[null,null,"2023-09-27"]
[null,null,"2023-09-28"]
[null,null,"2023-09-29"]
[null,null,"2023-09-30"]
[null,null,"2023-10-01"]
[null,null,"2023-10-02"]
[null,null,"2023-10-03"]
[null,null,"2023-10-04"]
[null,null,"2023-10-05"]
[null,null,"2023-10-06"]
[null,null,"2023-10-07"]
[null,null,"2023-10-08"]
[null,null,{"$f":"C387+1","v":"2023-10-09"}]
[null,null,"2023-10-10"]
[null,null,"2023-10-11"]
[null,null,"2023-10-12"]
[null,null,"2023-10-13"]
[null,null,"2023-10-14"]
[null,null,"2023-10-15"]
[null,null,"2023-10-16"]
[null,null,"2023-10-17"]
[null,null,"2023-10-18"]
[null,null,"2023-10-19"]
[null,null,"2023-10-20"]
[null,null,"2023-10-21"]
{"$rows_left_out":803}
{"sheet":"Premiums","index":1,"n_rows":99,"n_cols":4,"rows_kept":99,"cut":false,"hidden":true,"merged":[]}
["Létszám","A Opció","B Opció","C Opció"]
[3,50000,53100,72000]
[4,50000,70800,96000]
[5,52500,88500,120000]
[6,63000,106200,144000]
[7,73500,123900,168000]
[8,84000,141600,192000]
[9,94500,159300,216000]
[10,105000,177000,240000]
[11,115500,194700,264000]
[12,126000,212400,288000]
[13,136500,230100,312000]
[14,147000,247800,336000]
[15,157500,265500,360000]
[16,168000,283200,384000]
[17,178500,300900,408000]
[18,189000,318600,432000]
[19,199500,336300,456000]
[20,210000,354000,480000]
[21,220500,371700,504000]
[22,231000,389400,528000]
[23,241500,407100,552000]
[24,252000,424800,576000]
[25,262500,442500,600000]
[26,257400,436800,585000]
[27,267300,453600,607500]
[28,277200,470400,630000]
[29,287100,487200,652500]
[30,297000,504000,675000]
[31,306900,520800,697500]
[32,316800,537600,720000]
[33,326700,554400,742500]
[34,336600,571200,765000]
[35,346500,588000,787500]
[36,356400,604800,810000]
[37,366300,621600,832500]
[38,376200,638400,855000]
[39,386100,655200,877500]
[40,396000,672000,900000]
[41,405900,688800,922500]
[42,415800,705600,945000]
[43,425700,722400,967500]
[44,435600,739200,990000]
[45,445500,756000,1012500]
[46,455400,772800,1035000]
[47,465300,789600,1057500]
[48,475200,806400,1080000]
[49,485100,823200,1102500]
[50,495000,840000,1125000]
[51,443700,765000,1040400]
[52,452400,780000,1060800]
[53,461100,795000,1081200]
[54,469800,810000,1101600]
[55,478500,825000,1122000]
[56,487200,840000,1142400]
[57,495900,855000,1162800]
[58,504600,870000,1183200]
[59,513300,885000,1203600]
[60,522000,900000,1224000]
[61,530700,915000,1244400]
[62,539400,930000,1264800]
[63,548100,945000,1285200]
[64,556800,960000,1305600]
[65,565500,975000,1326000]
[66,574200,990000,1346400]
[67,582900,1005000,1366800]
[68,591600,1020000,1387200]
[69,600300,1035000,1407600]
[70,609000,1050000,1428000]
[71,617700,1065000,1448400]
[72,626400,1080000,1468800]
[73,635100,1095000,1489200]
[74,643800,1110000,1509600]
[75,652500,1125000,1530000]
[76,615600,1048800,1436400]
[77,623700,1062600,1455300]
[78,631800,1076400,1474200]
[79,639900,1090200,1493100]
[80,648000,1104000,1512000]
[81,656100,1117800,1530900]
[82,664200,1131600,1549800]
[83,672300,1145400,1568700]
[84,680400,1159200,1587600]
[85,688500,1173000,1606500]
[86,696600,1186800,1625400]
[87,704700,1200600,1644300]
[88,712800,1214400,1663200]
[89,720900,1228200,1682100]
[90,729000,1242000,1701000]
[91,737100,1255800,1719900]
[92,745200,1269600,1738800]
[93,753300,1283400,1757700]
[94,761400,1297200,1776600]
[95,769500,1311000,1795500]
[96,777600,1324800,1814400]
[97,785700,1338600,1833300]
[98,793800,1352400,1852200]
[99,801900,1366200,1871100]
[100,810000,1380000,1890000]