{"text_format":"1","workbook":"xlsx","n_sheets":4,"sheets":["Form","Premium","Premium (2)","Premiums"],"not_rendered":{"charts":0,"images":1,"macros":1,"external_links":0,"defined_names":1,"comments":0,"pivot_tables":0},"unopened":[],"bounds":{"document_bytes":16777216,"sheet_cells":100000,"rows_first":2000,"rows_last":500,"rows_between":2000,"halvings":0,"cell_chars":16384,"cell_head_chars":4096},"cells_cut":0,"cells_raw":0,"read":"whole","date_system":"1900"}

{"sheet":"Form","index":0,"n_rows":206,"n_cols":9,"rows_kept":206,"cut":false,"hidden":false,"merged":[[42,3,42,5],[43,3,43,5],[47,3,47,5],[45,3,45,5],[46,3,46,5],[28,3,28,5],[29,3,29,5],[31,3,31,5],[32,3,32,5],[33,3,33,5],[2,3,2,10],[74,7,77,10],[71,2,71,3],[62,1,62,10],[63,1,63,10],[64,1,64,10],[65,1,65,10],[55,7,55,10],[56,7,56,10],[55,2,55,3],[66,1,66,10],[67,1,67,10],[58,1,58,10],[60,1,60,10],[54,1,54,10],[40,3,40,5],[5,3,5,10],[7,3,7,10],[9,3,10,10],[23,0,23,5],[26,3,27,5],[26,6,26,8],[12,3,12,10],[20,1,20,2],[14,3,14,10],[16,3,16,10],[22,3,22,4],[25,3,25,4],[35,3,35,5],[36,3,36,5],[30,3,30,5],[94,1,97,10],[79,1,79,10],[82,1,85,10],[87,1,89,10],[91,1,93,10],[41,3,41,5],[37,3,37,5],[38,3,38,5],[39,3,39,5],[34,3,34,5],[49,6,49,8],[49,3,49,5],[47,6,47,8]]}
[]
[]
[null,null,null,"GPA: Csoportos Balesetbiztosítás - Rendezvény"]
[]
[]
[null,"Szerződő neve:"]
[]
[null,"Szerződő címe:"]
[]
[null,"Biztosítottak köre:",null,"A Szerződő által megrendezésre kerülő rendezvényen résztvevő 80 év alatti természetes személyek"]
[]
[]
[null,"Biztosításközvetítő cég neve:"]
[]
[null,"Rendezvény leírása:"]
[]
[null,"Időbeli és területi hatály:",null,"A Szerződő által megrendezésre kerülő rendezvény helyszíne és időtartama"]
[]
[null,"Rendezvény időtartama:",null,null," - tól",null," - ig"]
[]
[null,"Létszám:"]
[]
[null,"Sporttevékenység:"]
[]
[null,"Választott opció:"]
[]
[null,null,null,"Szolgáltatás",null,null,"Biztosítási összeg Ft/fő"]
[null,null,null,null,null,null,"A Opció","B Opció","C Opció"]
[null,null,null,"Baleseti halál",null,null,"500 000","2 000 000","5 000 000"]
[null,null,null,"Kiterjesztés - temetési költségek",null,null,"max. 500 000","max. 1 000 000"," max. 1 000 000"]
[null,null,null,"Baleseti Maradandó Rokkantság (1-100%)",null,null,"500 000","2 000 000","5 000 000"]
[null,null,null,"Kiterjesztés - átképzési költségek",null,null,"max. 500 000","max. 1 000 000"," max. 1 000 000"]
[null,null,null,"Kiterjesztés - kerekesszék költsége",null,null,"max. 500 000","max. 1 000 000"," max. 1 000 000"]
[null,null,null,"Közúti közlekedés alatt bekövetkezett balesetből származó halál",null,null," - ","2 000 000","5 000 000"]
[null,null,null,"Közúti közlekedés alatt bekövetkezett balesetből származó maradandó rokkantság (1-100%)",null,null," - ","2 000 000","5 000 000"]
[null,null,null,"Baleseti kórházi napi térítés( 1-90 napig )",null,null," - ","3 000","5 000"]
[null,null,null,"Önrész",null,null," - "," - "," - "]
[null,null,null,"Baleseti eredetű csonttörés ( egyösszegű )",null,null,"25 000","50 000","100 000"]
[null,null,null,"Égési sérülés",null,null," - ","200 000","300 000"]
[null,null,null,"Baleseti műtéti térítés",null,null,"250 000","300 000","500 000"]
[null,null,null,"Önrész",null,null," - "," - "," - "]
[null,null,null,"Ideiglenes teljes keresőképtelenség baleset esetén ( napi térítés max. 90 napra )",null,null," - "," - ","5 000"]
[null,null,null,"Önrész",null,null," - "," - "," - "]
[null,null,null,"Baleseti költségtérítés",null,null," - ","20 000 ","50 000"]
[]
[null,null,null,"Biztosítási díj / fő /nap ( Sport nélkül ):",null,null,100,320,730]
[null,null,null,"Biztosítási díj / fő/ nap ( Sport ):",null,null,150,480,1090]
[null,null,null,"Szolgáltatási időszak",null,null,"OP10- Speciális fedezet"]
[]
[null,null,null,"Biztosítási díj összesen/időszak:*",null,null,{"$f":"IF((((IF(D23=\"\",D25=\"\",IF(D23=\"Igen\",VLOOKUP(D25,'Premium (2)'!E:G,3,),IF(D23=\"Nem\",VLOOKUP(D25,'Premium (2)'!E:G,2,),IF(D25=\"A\",VLOOKUP(D25,'Premium (2)'!E:G,2,),IF(D25=\"B\",VLOOKUP(D25,'Premium (2)'!E:G,2,),IF(D25=\"C\",VLOOKUP(D25,'Premium (2)'!E:G,2)))))))))*'Premium (2)'!J1*D21)<30000,30000,((IF(D23=\"\",D25=\"\",IF(D23=\"Igen\",VLOOKUP(D25,'Premium (2)'!E:G,3,),IF(D23=\"Nem\",VLOOKUP(D25,'Premium (2)'!E:G,2,),IF(D25=\"A\",VLOOKUP(D25,'Premium (2)'!E:G,2,),IF(D25=\"B\",VLOOKUP(D25,'Premium (2)'!E:G,2,),IF(D25=\"C\",VLOOKUP(D25,'Premium (2)'!E:G,2)))))))))*'Premium (2)'!J1*D21)","v":30000}]
[null,null,null,"* Minimum díj 30.000 Ft"]
[null,null,null,"Feltételrendszer: Colonnade Insurance S.A. Magyarországi Fióktelepe"]
[null,null,null,"Colonnade Csoportos baleset- és betegségbiztosítás | Szerződési Feltételek 001-2022"]
[]
[null,"Alulírott Szerződő tudomásul veszem, hogy a Biztosító által 202_________________-én kiadott tájékoztató díjajánlat aláírásommal a Biztosító felé szerződéskötésre tett ajánlattá (továbbiakban: ajánlat) alakul át.\n\nTudomásul veszem, hogy\n- jelen ajánlati lap visszaküldése nem eredményezi sem a biztosítási szerződés automatikus,  létrejöttét sem a biztosító automatikus kockázatviselését;\n- a biztosítási szerződéssel kapcsolatos adatokat a biztosító nyilvántartja és kezeli.\n\nAlulírott, mint Szerződő aláírásra jogosult képviselője, ezúton tudomásul veszem, hogy a biztosítási kötvényt és a hozzá kapcsolódó dokumentumokat elektronikus formában fogom megkapni. \n\nJelen tájékoztató díjajánlatot elfogadom.\n"]
[null,"Dátum:",{"$f":"TODAY()","v":"2022-08-22"}]
[null,null,null,null,null,null,null,"szerződő/biztosított/társbiztosított \n        cégszerű aláírása"]
[]
[null,"NYILATKOZAT"]
[]
{"$rows_left_out":147}
{"sheet":"Premium","index":1,"n_rows":368,"n_cols":19,"rows_kept":368,"cut":false,"hidden":true,"merged":[[1,17,1,18]]}
["Opció","No sport napi díj/fő","Sport napi díj/fő",null,"Létszám","A","B","C","Létszám","A","B","C",null,"Időtartam",{"$f":"Form!F19-Form!D19","v":0}]
["A",100,150,null,3,{"$f":"30000","v":30000},{"$f":"30000","v":30000},{"$f":"30000","v":30000},3,{"$f":"30000","v":30000},{"$f":"30000","v":30000},{"$f":"30000","v":30000},null,null,null,null,null,"Időtartam"]
["B",320,480,null,4,{"$f":"30000","v":30000},{"$f":"30000","v":30000},{"$f":"30000","v":30000},4,{"$f":"30000","v":30000},{"$f":"30000","v":30000},{"$f":"30000","v":30000},null,null,null,null,null,{"$f":"TODAY()+1","v":"2022-08-23"},{"$f":"TODAY()+1","v":"2022-08-23"}]
["C",730,1090,null,5,{"$f":"30000","v":30000},{"$f":"30000","v":30000},{"$f":"30000","v":30000},5,{"$f":"30000","v":30000},{"$f":"30000","v":30000},{"$f":"30000","v":30000},null,null,null,null,null,{"$f":"R3+1","v":"2022-08-24"},{"$f":"S3+1","v":"2022-08-24"}]
[null,null,null,null,6,{"$f":"30000","v":30000},{"$f":"30000","v":30000},{"$f":"30000","v":30000},6,{"$f":"30000","v":30000},{"$f":"30000","v":30000},{"$f":"30000","v":30000},null,null,null,null,null,{"$f":"R4+1","v":"2022-08-25"},{"$f":"S4+1","v":"2022-08-25"}]
[null,null,null,null,7,{"$f":"30000","v":30000},{"$f":"30000","v":30000},{"$f":"30000","v":30000},7,{"$f":"30000","v":30000},{"$f":"30000","v":30000},{"$f":"30000","v":30000},null,null,null,null,null,{"$f":"R5+1","v":"2022-08-26"},"2022-08-26"]
[null,null,null,null,8,{"$f":"30000","v":30000},{"$f":"30000","v":30000},{"$f":"30000","v":30000},8,{"$f":"30000","v":30000},{"$f":"30000","v":30000},{"$f":"30000","v":30000},null,null,null,null,null,"2022-08-27","2022-08-27"]
[null,null,null,null,9,{"$f":"30000","v":30000},{"$f":"30000","v":30000},{"$f":"30000","v":30000},9,{"$f":"30000","v":30000},{"$f":"30000","v":30000},{"$f":"30000","v":30000},null,null,null,null,null,"2022-08-28","2022-08-28"]
[null,null,null,null,10,{"$f":"30000","v":30000},{"$f":"30000","v":30000},{"$f":"30000","v":30000},10,{"$f":"30000","v":30000},{"$f":"30000","v":30000},{"$f":"30000","v":30000},null,null,null,null,null,"2022-08-29","2022-08-29"]
[null,null,null,null,11,{"$f":"30000","v":30000},{"$f":"30000","v":30000},{"$f":"30000","v":30000},11,{"$f":"30000","v":30000},{"$f":"30000","v":30000},{"$f":"30000","v":30000},null,null,null,null,null,"2022-08-30","2022-08-30"]
[null,null,null,null,12,{"$f":"30000","v":30000},{"$f":"30000","v":30000},{"$f":"30000","v":30000},12,{"$f":"30000","v":30000},{"$f":"30000","v":30000},{"$f":"30000","v":30000},null,null,null,null,null,"2022-08-31","2022-08-31"]
[null,null,null,null,13,{"$f":"30000","v":30000},{"$f":"30000","v":30000},{"$f":"30000","v":30000},13,{"$f":"30000","v":30000},{"$f":"30000","v":30000},{"$f":"30000","v":30000},null,null,null,null,null,"2022-09-01","2022-09-01"]
[null,null,null,null,14,{"$f":"30000","v":30000},{"$f":"30000","v":30000},{"$f":"30000","v":30000},14,{"$f":"30000","v":30000},{"$f":"30000","v":30000},{"$f":"30000","v":30000},null,null,null,null,null,"2022-09-02","2022-09-02"]
[null,null,null,null,15,{"$f":"30000","v":30000},{"$f":"30000","v":30000},{"$f":"30000","v":30000},15,{"$f":"30000","v":30000},{"$f":"30000","v":30000},{"$f":"30000","v":30000},null,null,null,null,null,"2022-09-03","2022-09-03"]
[null,null,null,null,16,{"$f":"30000","v":30000},{"$f":"30000","v":30000},{"$f":"30000","v":30000},16,{"$f":"30000","v":30000},{"$f":"30000","v":30000},{"$f":"30000","v":30000},null,null,null,null,null,"2022-09-04","2022-09-04"]
[null,null,null,null,17,{"$f":"30000","v":30000},{"$f":"30000","v":30000},{"$f":"30000","v":30000},17,{"$f":"30000","v":30000},{"$f":"30000","v":30000},{"$f":"30000","v":30000},null,null,null,null,null,"2022-09-05","2022-09-05"]
[null,null,null,null,18,{"$f":"30000","v":30000},{"$f":"30000","v":30000},{"$f":"30000","v":30000},18,{"$f":"30000","v":30000},{"$f":"30000","v":30000},{"$f":"30000","v":30000},null,null,null,null,null,"2022-09-06","2022-09-06"]
[null,null,null,null,19,{"$f":"30000","v":30000},{"$f":"30000","v":30000},{"$f":"30000","v":30000},19,{"$f":"30000","v":30000},{"$f":"30000","v":30000},{"$f":"30000","v":30000},null,null,null,null,null,"2022-09-07","2022-09-07"]
[null,null,null,null,20,{"$f":"30000","v":30000},{"$f":"30000","v":30000},{"$f":"30000","v":30000},20,{"$f":"30000","v":30000},{"$f":"30000","v":30000},{"$f":"30000","v":30000},null,null,null,null,null,"2022-09-08","2022-09-08"]
[null,null,null,null,21,{"$f":"30000","v":30000},{"$f":"30000","v":30000},{"$f":"30000","v":30000},21,{"$f":"30000","v":30000},{"$f":"30000","v":30000},{"$f":"30000","v":30000},null,null,null,null,null,"2022-09-09","2022-09-09"]
[null,null,null,null,22,{"$f":"30000","v":30000},{"$f":"30000","v":30000},{"$f":"30000","v":30000},22,{"$f":"30000","v":30000},{"$f":"30000","v":30000},{"$f":"30000","v":30000},null,null,null,null,null,"2022-09-10","2022-09-10"]
[null,null,null,null,23,{"$f":"30000","v":30000},{"$f":"30000","v":30000},{"$f":"30000","v":30000},23,{"$f":"30000","v":30000},{"$f":"30000","v":30000},{"$f":"30000","v":30000},null,null,null,null,null,"2022-09-11","2022-09-11"]
[null,null,null,null,24,{"$f":"30000","v":30000},{"$f":"30000","v":30000},{"$f":"30000","v":30000},24,{"$f":"30000","v":30000},{"$f":"30000","v":30000},{"$f":"30000","v":30000},null,null,null,null,null,"2022-09-12","2022-09-12"]
[null,null,null,null,25,{"$f":"30000","v":30000},{"$f":"30000","v":30000},{"$f":"30000","v":30000},25,{"$f":"30000","v":30000},{"$f":"30000","v":30000},{"$f":"30000","v":30000},null,null,null,null,null,"2022-09-13","2022-09-13"]
[null,null,null,null,26,{"$f":"30000","v":30000},{"$f":"30000","v":30000},{"$f":"30000","v":30000},26,{"$f":"30000","v":30000},{"$f":"30000","v":30000},{"$f":"30000","v":30000},null,null,null,null,null,"2022-09-14","2022-09-14"]
[null,null,null,null,27,{"$f":"30000","v":30000},{"$f":"30000","v":30000},{"$f":"30000","v":30000},27,{"$f":"30000","v":30000},{"$f":"30000","v":30000},{"$f":"30000","v":30000},null,null,null,null,null,"2022-09-15","2022-09-15"]
[null,null,null,null,28,{"$f":"30000","v":30000},{"$f":"30000","v":30000},{"$f":"30000","v":30000},28,{"$f":"30000","v":30000},{"$f":"30000","v":30000},{"$f":"$C$4*I27","v":30520},null,null,null,null,null,"2022-09-16","2022-09-16"]
[null,null,null,null,29,{"$f":"30000","v":30000},{"$f":"30000","v":30000},{"$f":"30000","v":30000},29,{"$f":"30000","v":30000},{"$f":"30000","v":30000},31610,null,null,null,null,null,"2022-09-17","2022-09-17"]
[null,null,null,null,30,{"$f":"30000","v":30000},{"$f":"30000","v":30000},{"$f":"30000","v":30000},30,{"$f":"30000","v":30000},{"$f":"30000","v":30000},32700,null,null,null,null,null,"2022-09-18","2022-09-18"]
[null,null,null,null,31,{"$f":"30000","v":30000},{"$f":"30000","v":30000},{"$f":"30000","v":30000},31,{"$f":"30000","v":30000},{"$f":"30000","v":30000},33790,null,null,null,null,null,"2022-09-19","2022-09-19"]
[null,null,null,null,32,{"$f":"30000","v":30000},{"$f":"30000","v":30000},{"$f":"30000","v":30000},32,{"$f":"30000","v":30000},{"$f":"30000","v":30000},34880,null,null,null,null,null,"2022-09-20","2022-09-20"]
[null,null,null,null,33,{"$f":"30000","v":30000},{"$f":"30000","v":30000},{"$f":"30000","v":30000},33,{"$f":"30000","v":30000},{"$f":"30000","v":30000},35970,null,null,null,null,null,"2022-09-21","2022-09-21"]
[null,null,null,null,34,{"$f":"30000","v":30000},{"$f":"30000","v":30000},{"$f":"30000","v":30000},34,{"$f":"30000","v":30000},{"$f":"30000","v":30000},37060,null,null,null,null,null,"2022-09-22","2022-09-22"]
[null,null,null,null,35,{"$f":"30000","v":30000},{"$f":"30000","v":30000},{"$f":"30000","v":30000},35,{"$f":"30000","v":30000},{"$f":"30000","v":30000},38150,null,null,null,null,null,"2022-09-23","2022-09-23"]
[null,null,null,null,36,{"$f":"30000","v":30000},{"$f":"30000","v":30000},{"$f":"30000","v":30000},36,{"$f":"30000","v":30000},{"$f":"30000","v":30000},39240,null,null,null,null,null,"2022-09-24","2022-09-24"]
[null,null,null,null,37,{"$f":"30000","v":30000},{"$f":"30000","v":30000},{"$f":"30000","v":30000},37,{"$f":"30000","v":30000},{"$f":"30000","v":30000},40330,null,null,null,null,null,"2022-09-25","2022-09-25"]
[null,null,null,null,38,{"$f":"30000","v":30000},{"$f":"30000","v":30000},{"$f":"30000","v":30000},38,{"$f":"30000","v":30000},{"$f":"30000","v":30000},41420,null,null,null,null,null,"2022-09-26","2022-09-26"]
[null,null,null,null,39,{"$f":"30000","v":30000},{"$f":"30000","v":30000},{"$f":"30000","v":30000},39,{"$f":"30000","v":30000},{"$f":"30000","v":30000},42510,null,null,null,null,null,"2022-09-27","2022-09-27"]
[null,null,null,null,40,{"$f":"30000","v":30000},{"$f":"30000","v":30000},{"$f":"30000","v":30000},40,{"$f":"30000","v":30000},{"$f":"30000","v":30000},43600,null,null,null,null,null,"2022-09-28","2022-09-28"]
[null,null,null,null,41,{"$f":"30000","v":30000},{"$f":"30000","v":30000},{"$f":"30000","v":30000},41,{"$f":"30000","v":30000},{"$f":"30000","v":30000},44690,null,null,null,null,null,"2022-09-29","2022-09-29"]
[null,null,null,null,42,{"$f":"30000","v":30000},{"$f":"30000","v":30000},{"$f":"$B$4*E41","v":30660},42,{"$f":"30000","v":30000},{"$f":"30000","v":30000},45780,null,null,null,null,null,"2022-09-30","2022-09-30"]
[null,null,null,null,43,{"$f":"30000","v":30000},{"$f":"30000","v":30000},31390,43,{"$f":"30000","v":30000},{"$f":"30000","v":30000},46870,null,null,null,null,null,"2022-10-01","2022-10-01"]
[null,null,null,null,44,{"$f":"30000","v":30000},{"$f":"30000","v":30000},32120,44,{"$f":"30000","v":30000},{"$f":"30000","v":30000},47960,null,null,null,null,null,"2022-10-02","2022-10-02"]
[null,null,null,null,45,{"$f":"30000","v":30000},{"$f":"30000","v":30000},32850,45,{"$f":"30000","v":30000},{"$f":"30000","v":30000},49050,null,null,null,null,null,"2022-10-03","2022-10-03"]
[null,null,null,null,46,{"$f":"30000","v":30000},{"$f":"30000","v":30000},33580,46,{"$f":"30000","v":30000},{"$f":"30000","v":30000},50140,null,null,null,null,null,"2022-10-04","2022-10-04"]
[null,null,null,null,47,{"$f":"30000","v":30000},{"$f":"30000","v":30000},34310,47,{"$f":"30000","v":30000},{"$f":"30000","v":30000},51230,null,null,null,null,null,"2022-10-05","2022-10-05"]
[null,null,null,null,48,{"$f":"30000","v":30000},{"$f":"30000","v":30000},35040,48,{"$f":"30000","v":30000},{"$f":"30000","v":30000},52320,null,null,null,null,null,"2022-10-06","2022-10-06"]
[null,null,null,null,49,{"$f":"30000","v":30000},{"$f":"30000","v":30000},35770,49,{"$f":"30000","v":30000},{"$f":"30000","v":30000},53410,null,null,null,null,null,"2022-10-07","2022-10-07"]
[null,null,null,null,50,{"$f":"30000","v":30000},{"$f":"30000","v":30000},36500,50,{"$f":"30000","v":30000},{"$f":"30000","v":30000},54500,null,null,null,null,null,"2022-10-08","2022-10-08"]
[null,null,null,null,51,{"$f":"30000","v":30000},{"$f":"30000","v":30000},37230,51,{"$f":"30000","v":30000},{"$f":"30000","v":30000},55590,null,null,null,null,null,"2022-10-09","2022-10-09"]
[null,null,null,null,52,{"$f":"30000","v":30000},{"$f":"30000","v":30000},37960,52,{"$f":"30000","v":30000},{"$f":"30000","v":30000},56680,null,null,null,null,null,"2022-10-10","2022-10-10"]
[null,null,null,null,53,{"$f":"30000","v":30000},{"$f":"30000","v":30000},38690,53,{"$f":"30000","v":30000},{"$f":"30000","v":30000},57770,null,null,null,null,null,"2022-10-11","2022-10-11"]
[null,null,null,null,54,{"$f":"30000","v":30000},{"$f":"30000","v":30000},39420,54,{"$f":"30000","v":30000},{"$f":"30000","v":30000},58860,null,null,null,null,null,"2022-10-12","2022-10-12"]
[null,null,null,null,55,{"$f":"30000","v":30000},{"$f":"30000","v":30000},40150,55,{"$f":"30000","v":30000},{"$f":"30000","v":30000},59950,null,null,null,null,null,"2022-10-13","2022-10-13"]
[null,null,null,null,56,{"$f":"30000","v":30000},{"$f":"30000","v":30000},40880,56,{"$f":"30000","v":30000},{"$f":"30000","v":30000},61040,null,null,null,null,null,"2022-10-14","2022-10-14"]
[null,null,null,null,57,{"$f":"30000","v":30000},{"$f":"30000","v":30000},41610,57,{"$f":"30000","v":30000},{"$f":"30000","v":30000},62130,null,null,null,null,null,"2022-10-15","2022-10-15"]
[null,null,null,null,58,{"$f":"30000","v":30000},{"$f":"30000","v":30000},42340,58,{"$f":"30000","v":30000},{"$f":"30000","v":30000},63220,null,null,null,null,null,"2022-10-16","2022-10-16"]
[null,null,null,null,59,{"$f":"30000","v":30000},{"$f":"30000","v":30000},43070,59,{"$f":"30000","v":30000},{"$f":"30000","v":30000},64310,null,null,null,null,null,"2022-10-17","2022-10-17"]
[null,null,null,null,60,{"$f":"30000","v":30000},{"$f":"30000","v":30000},43800,60,{"$f":"30000","v":30000},{"$f":"30000","v":30000},65400,null,null,null,null,null,"2022-10-18","2022-10-18"]
[null,null,null,null,61,{"$f":"30000","v":30000},{"$f":"30000","v":30000},44530,61,{"$f":"30000","v":30000},{"$f":"30000","v":30000},66490,null,null,null,null,null,"2022-10-19","2022-10-19"]
{"$rows_left_out":309}
{"sheet":"Premium (2)","index":2,"n_rows":4,"n_cols":10,"rows_kept":4,"cut":false,"hidden":true,"merged":[]}
["Opció","No sport napi díj/fő","Sport napi díj/fő",null,"A",100,150,null,"Időtartam",{"$f":"DATEDIF(Form!D19,Form!F19,\"d\")+1","v":1}]
["A",100,150,null,"B",320,480]
["B",320,480,null,"C",730,1090]
["C",730,1090]

{"sheet":"Premiums","index":3,"n_rows":99,"n_cols":4,"rows_kept":99,"cut":false,"hidden":true,"merged":[]}
["Létszám","A Opció","B Opció","C Opció"]
[3,50000,53100,72000]
[4,50000,70800,96000]
[5,52500,88500,120000]
[6,63000,106200,144000]
[7,73500,123900,168000]
[8,84000,141600,192000]
[9,94500,159300,216000]
[10,105000,177000,240000]
[11,115500,194700,264000]
[12,126000,212400,288000]
[13,136500,230100,312000]
[14,147000,247800,336000]
[15,157500,265500,360000]
[16,168000,283200,384000]
[17,178500,300900,408000]
[18,189000,318600,432000]
[19,199500,336300,456000]
[20,210000,354000,480000]
[21,220500,371700,504000]
[22,231000,389400,528000]
[23,241500,407100,552000]
[24,252000,424800,576000]
[25,262500,442500,600000]
[26,257400,436800,585000]
[27,267300,453600,607500]
[28,277200,470400,630000]
[29,287100,487200,652500]
[30,297000,504000,675000]
[31,306900,520800,697500]
[32,316800,537600,720000]
[33,326700,554400,742500]
[34,336600,571200,765000]
[35,346500,588000,787500]
[36,356400,604800,810000]
[37,366300,621600,832500]
[38,376200,638400,855000]
[39,386100,655200,877500]
[40,396000,672000,900000]
[41,405900,688800,922500]
[42,415800,705600,945000]
[43,425700,722400,967500]
[44,435600,739200,990000]
[45,445500,756000,1012500]
[46,455400,772800,1035000]
[47,465300,789600,1057500]
[48,475200,806400,1080000]
[49,485100,823200,1102500]
[50,495000,840000,1125000]
[51,443700,765000,1040400]
[52,452400,780000,1060800]
[53,461100,795000,1081200]
[54,469800,810000,1101600]
[55,478500,825000,1122000]
[56,487200,840000,1142400]
[57,495900,855000,1162800]
[58,504600,870000,1183200]
[59,513300,885000,1203600]
[60,522000,900000,1224000]
[61,530700,915000,1244400]
{"$rows_left_out":39}